Tourism
type: Concept
broader: http://zbw.eu/beta/pm20voc/pr/i/126650
narrower: http://zbw.eu/beta/pm20voc/pr/i/72520
narrower: http://zbw.eu/beta/pm20voc/pr/i/72518
preferred label: Tourismus @de
NotationLong: VK11
in scheme: pr
notation: VK11
scope note: (einschl.: Reiseverkehr, Fremdenverkehr) @de

NotationLong
sub property of: notation
definition: EXPERIMENTAL: Notation with blanks and leading zeros for sortability.