Kommunikationsfreiheit
type: Concept
scope note: (einschl.: Pressefreiheit, Medienpolitik, Medienrecht)
broader: http://zbw.eu/beta/pm20voc/pr/i/126662
notation: IK01
NotationLong: IK01
in scheme: pr

NotationLong
sub property of: notation
definition: EXPERIMENTAL: Notation with blanks and leading zeros for sortability. @en