Telecommunications
type: Concept
preferred label: Telekommunikation @de
notation: IK04
broader: http://zbw.eu/beta/pm20voc/pr/i/126662
scope note: (einschl.: Telekommunikationspolitik) @de
narrower: http://zbw.eu/beta/pm20voc/pr/i/72510
narrower: http://zbw.eu/beta/pm20voc/pr/i/72511
in scheme: pr
NotationLong: IK04

NotationLong
sub property of: notation
definition: EXPERIMENTAL: Notation with blanks and leading zeros for sortability.