Credit insurance
type: Concept
broader: http://zbw.eu/beta/pm20voc/pr/i/126671
scope note: (einschl.: Exportkreditversicherung) @de
in scheme: pr
notation: VS07
preferred label: Kreditversicherung @de
NotationLong: VS07

NotationLong
sub property of: notation
definition: EXPERIMENTAL: Notation with blanks and leading zeros for sortability.