NotationLong
sub property of: notation
definition: EXPERIMENTAL: Notation with blanks and leading zeros for sortability.

Property insurance
type: Concept
notation: VS08
NotationLong: VS08
label: Sachversicherung @de
broader: http://zbw.eu/beta/pm20voc/pr/i/126671
scope note: (einschl.: Einbruchdiebstahlversicherung, Glasversicherung, Hausratversicherung; einschl. Feuerversicherung, Elementarschadenversicherung, Wohngebäudeversicherung) @de
in scheme: pr