NotationLong
sub property of: notation
definition: EXPERIMENTAL: Notation with blanks and leading zeros for sortability.

Auto insurance
type: Concept
scope note: (einschl.: Kfz-Haftpflichtversicherung) @de
broader: http://zbw.eu/beta/pm20voc/pr/i/126671
preferred label: Kraftfahrtversicherung @de
in scheme: pr
NotationLong: VS09
notation: VS09