Housing Industry
type: Concept
broader: http://zbw.eu/beta/pm20voc/pr/i/126683
narrower: http://zbw.eu/beta/pm20voc/pr/i/72457
narrower: http://zbw.eu/beta/pm20voc/pr/i/72452
narrower: http://zbw.eu/beta/pm20voc/pr/i/72453
NotationLong: IW01
notation: IW01
label: Wohnungswirtschaft @de
in scheme: pr
scope note: (einschl.: Wohnungsmarkt, Wohnungsbau) @de

NotationLong
sub property of: notation
definition: EXPERIMENTAL: Notation with blanks and leading zeros for sortability.