NotationLong
sub property of: notation
definition: EXPERIMENTAL: Notation with blanks and leading zeros for sortability.

Emergency aid
type: Concept
NotationLong: OV05
notation: OV05
label: Katastrophenhilfe @de
editorial note: sowie entsprechende Verordnung, Gesetz, Träger @de
in scheme: pr
scope note: (einschl.: Zivilschutz, Brandschutz, Feuerwehr) @de
broader: http://zbw.eu/beta/pm20voc/pr/i/126689