Consumer protection
type: Concept
in scheme: pr
notation: NP05
broader: http://zbw.eu/beta/pm20voc/pr/i/126698
preferred label: Verbraucherschutz @de
NotationLong: NP05
scope note: (einschl.: Verbraucherpolitik, Warentest) @de

NotationLong
sub property of: notation
definition: EXPERIMENTAL: Notation with blanks and leading zeros for sortability.