NotationLong
sub property of: notation
definition: EXPERIMENTAL: Notation with blanks and leading zeros for sortability.

Hospital
type: Concept
label: Krankenhaus @de
NotationLong: GE04.02
in scheme: pr
notation: GE04.02
scope note: (einschl.: Rehabilitationseinrichtung, Reha-Zentrum) @de
broader: http://zbw.eu/beta/pm20voc/pr/i/72403