NotationLong
sub property of: notation
definition: EXPERIMENTAL: Notation with blanks and leading zeros for sortability.

Distributive Politics
type: Concept
label: Verteilungspolitik @de
broader: http://zbw.eu/beta/pm20voc/pr/i/72378
narrower: http://zbw.eu/beta/pm20voc/pr/i/72376
NotationLong: VW03.01
notation: VW03.01
in scheme: pr
scope note: (einschl.: Vermögenspolitik, Vermögensbildung in Arbeitnehmerhand) @de