Price level
type: Concept
label: Preisniveau @de
scope note: (ausschl.: Für Außenwert des Geldes vgl. aber: Währung) (einschl.: Geldwert, Binnenwert des Geldes, Lebenshaltungskosten, Lebenshaltungskosten(-index), Inflation, Deflation) @de
broader: http://zbw.eu/beta/pm20voc/pr/i/72374
NotationLong: VW06.02
notation: VW06.02
in scheme: pr

NotationLong
sub property of: notation
definition: EXPERIMENTAL: Notation with blanks and leading zeros for sortability.