NotationLong
sub property of: notation
definition: EXPERIMENTAL: Notation with blanks and leading zeros for sortability.

Forward Market
type: Concept
preferred label: Terminmarkt @de
NotationLong: GF04.02
in scheme: pr
notation: GF04.02
editorial note: einzelne Terminmärkte bei jeweiligem Spezialmarkt; z.B. Aktienterminhandel zu: Aktienmarkt @de
broader: http://zbw.eu/beta/pm20voc/pr/i/72350
scope note: (einschl.: Optionshandel, Warenterminhandel) @de