Trade liberalization
type: Concept
broader: http://zbw.eu/beta/pm20voc/pr/i/72335
label: Außenhandelsliberalisierung @de
in scheme: pr
scope note: (einschl.: Außenhandelsbeschränkung) @de
NotationLong: AW02.03
notation: AW02.03

NotationLong
sub property of: notation
definition: EXPERIMENTAL: Notation with blanks and leading zeros for sortability.