NotationLong
sub property of: notation
definition: EXPERIMENTAL: Notation with blanks and leading zeros for sortability.

Compensation system
type: Concept
broader: http://zbw.eu/beta/pm20voc/pr/i/72258
label: Vergütungssystem @de
scope note: (einschl.: betriebliche Sozialleistungen) @de
notation: BW05.01
NotationLong: BW05.01
in scheme: pr