NotationLong
sub property of: notation
definition: EXPERIMENTAL: Notation with blanks and leading zeros for sortability.

Agricultural production
type: Concept
broader: http://zbw.eu/beta/pm20voc/pr/i/126584
in scheme: pr
preferred label: Agrarproduktion @de
notation: LW01
scope note: (einschl.: Agrarstatistik, Agrarprodukt, Agrarpreispolitik, Agrarpreisindex, landwirtschaftliche Outputfaktoren, Einkommen der Landwirte) @de
narrower: http://zbw.eu/beta/pm20voc/pr/i/73458
NotationLong: LW01