NotationLong
sub property of: notation
definition: EXPERIMENTAL: Notation with blanks and leading zeros for sortability.

Agricultural structure
type: Concept
notation: LW02
NotationLong: LW02
label: Agrarstruktur @de
scope note: Kennzeichnet die Struktur der Landwirtschaft und des ländlichen Raumes (einschl.: Bodenreform, Betriebsgröße, Bewirtschaftungsform, Bodennutzung, landwirtschaftliche Inputfaktoren) @de
narrower: http://zbw.eu/beta/pm20voc/pr/i/72237
broader: http://zbw.eu/beta/pm20voc/pr/i/126584
in scheme: pr