Tierhaltung
type: Concept
editorial note: Jagd als Wirtschaftsfaktor
narrower: http://zbw.eu/beta/pm20voc/pr/i/73075
narrower: http://zbw.eu/beta/pm20voc/pr/i/73134
narrower: http://zbw.eu/beta/pm20voc/pr/i/73080
narrower: http://zbw.eu/beta/pm20voc/pr/i/73082
narrower: http://zbw.eu/beta/pm20voc/pr/i/73077
narrower: http://zbw.eu/beta/pm20voc/pr/i/73081
narrower: http://zbw.eu/beta/pm20voc/pr/i/73078
narrower: http://zbw.eu/beta/pm20voc/pr/i/73079
narrower: http://zbw.eu/beta/pm20voc/pr/i/73076
broader: http://zbw.eu/beta/pm20voc/pr/i/126584
label: Animal Husbandry @en
scope note: (ausschl.: hier nicht: Jagd unter sportlichen oder Natur- bzw. Tierschutzaspekten) (einschl.: Tier, Pferd, Jagd, Produkte von Tieren)
NotationLong: LW05
notation: LW05
in scheme: pr

NotationLong
sub property of: notation
definition: EXPERIMENTAL: Notation with blanks and leading zeros for sortability. @en