NotationLong
sub property of: notation
definition: EXPERIMENTAL: Notation with blanks and leading zeros for sortability.

Utilities industry
type: Concept
notation: EW03
in scheme: pr
label: Versorgungswirtschaft @de
scope note: kombinierte Wasser- und Energieversorgung (einschl.: Stadtwerke, Beleuchtung im öffentlichen Raum) @de
broader: http://zbw.eu/beta/pm20voc/pr/i/124344
NotationLong: EW03