Recycling
type: Concept
scope note: (einschl.: Abfallrecycling, Sekundärrohstoff)
broader: http://zbw.eu/beta/pm20voc/pr/i/72208
in scheme: pr
notation: RB01.02
NotationLong: RB01.02

NotationLong
sub property of: notation
definition: EXPERIMENTAL: Notation with blanks and leading zeros for sortability. @en