Chemical plant equipment
type: Concept
label: Chemieindustrieausrüstung @de
broader: http://zbw.eu/beta/pm20voc/pr/i/73004
in scheme: pr
notation: ID08-Ch
scope note: (einschl.: Destillationsanlage, Oberflächenbehandlungsapparat) @de
NotationLong: ID08-Ch

NotationLong
sub property of: notation
definition: EXPERIMENTAL: Notation with blanks and leading zeros for sortability.