Wood-processing machinery
type: Concept
label: Holzbearbeitungsmaschine @de
broader: http://zbw.eu/beta/pm20voc/pr/i/73004
in scheme: pr
notation: ID08-Hz
scope note: (einschl.: Holzverarbeitungsmaschine) @de
NotationLong: ID08-Hz

NotationLong
sub property of: notation
definition: EXPERIMENTAL: Notation with blanks and leading zeros for sortability.