Aircraft industry
type: Concept
label: Luftfahrtindustrie @de
broader: http://zbw.eu/beta/pm20voc/pr/i/72973
in scheme: pr
narrower: http://zbw.eu/beta/pm20voc/pr/i/72966
notation: ID09.01
scope note: (einschl.: Flugzeugbau, Luftfahrzeug) @de
NotationLong: ID09.01

NotationLong
sub property of: notation
definition: EXPERIMENTAL: Notation with blanks and leading zeros for sortability.