Kraftfahrzeugteileindustrie
type: Concept
broader: http://zbw.eu/beta/pm20voc/pr/i/72973
in scheme: pr
notation: ID09.03
scope note: (einschl.: Kfz-Zulieferer, Kraftfahrzeugteil)
NotationLong: ID09.03

NotationLong
sub property of: notation
definition: EXPERIMENTAL: Notation with blanks and leading zeros for sortability. @en