Precision Engineering and Optical Industry
type: Concept
label: Feinmechanische und Optische Industrie @de
broader: http://zbw.eu/beta/pm20voc/pr/i/126593
in scheme: pr
narrower: http://zbw.eu/beta/pm20voc/pr/i/72896
narrower: http://zbw.eu/beta/pm20voc/pr/i/72898
narrower: http://zbw.eu/beta/pm20voc/pr/i/72897
notation: ID12
scope note: (einschl.: Mikromechanik, feinmechanisches Produkt, optisches Produkt, Lupe, Mikroskop) @de
NotationLong: ID12

NotationLong
sub property of: notation
definition: EXPERIMENTAL: Notation with blanks and leading zeros for sortability.