Internationale Sicherheitspolitik
type: Concept
broader: http://zbw.eu/beta/pm20voc/pr/i/72865
in scheme: pr
notation: PO02.02
scope note: (einschl.: Entspannungspolitik, Friedenspolitik, Abrüstung)
NotationLong: PO02.02

NotationLong
sub property of: notation
definition: EXPERIMENTAL: Notation with blanks and leading zeros for sortability. @en