Pharmaceutical Industry
type: Concept
label: Pharmazeutische Industrie @de
broader: http://zbw.eu/beta/pm20voc/pr/i/72895
in scheme: pr
narrower: http://zbw.eu/beta/pm20voc/pr/i/72849
narrower: http://zbw.eu/beta/pm20voc/pr/i/72852
narrower: http://zbw.eu/beta/pm20voc/pr/i/72846
narrower: http://zbw.eu/beta/pm20voc/pr/i/72851
notation: ID13.01
scope note: (einschl.: Pharmazeutisches Produkt, Arzneidroge, Heilmittel, Homöopathisches Produkt, Implantat, Impfstoff, Organe, Pflanzliches Arzneimittel) @de
NotationLong: ID13.01

NotationLong
sub property of: notation
definition: EXPERIMENTAL: Notation with blanks and leading zeros for sortability.