International migration
type: Concept
label: Internationale Wanderung @de
broader: http://zbw.eu/beta/pm20voc/pr/i/126763
in scheme: pr
notation: PO03
scope note: (einschl.: Einwanderung, Auswanderung, Migration, Flucht) @de
NotationLong: PO03

NotationLong
sub property of: notation
definition: EXPERIMENTAL: Notation with blanks and leading zeros for sortability.