Ready meal
type: Concept
label: Fertiggericht @de
broader: http://zbw.eu/beta/pm20voc/pr/i/72766
in scheme: pr
notation: ID20-Fg
scope note: (einschl.: Fertignahrung, Konserve, Tiefkühlkost) @de
NotationLong: ID20-Fg

NotationLong
sub property of: notation
definition: EXPERIMENTAL: Notation with blanks and leading zeros for sortability.