Tobacco industry
type: Concept
label: Tabakindustrie @de
broader: http://zbw.eu/beta/pm20voc/pr/i/72766
in scheme: pr
narrower: http://zbw.eu/beta/pm20voc/pr/i/72745
narrower: http://zbw.eu/beta/pm20voc/pr/i/72744
notation: ID20.01
scope note: (einschl.: Tabakwaren, Raucherbedarf) @de
NotationLong: ID20.01

NotationLong
sub property of: notation
definition: EXPERIMENTAL: Notation with blanks and leading zeros for sortability.