Politische Partizipation
type: Concept
broader: http://zbw.eu/beta/pm20voc/pr/i/72700
editorial note: Für Bürgerbeteiligung vgl. aber: bei den entsprechende Sachstellen
in scheme: pr
notation: RE01.01.01
scope note: (einschl.: Versammlungsrecht, Meinungsfreiheit)
NotationLong: RE01.01.01

NotationLong
sub property of: notation
definition: EXPERIMENTAL: Notation with blanks and leading zeros for sortability. @en