Industrial property rights
type: Concept
label: Gewerblicher Rechtsschutz @de
broader: http://zbw.eu/beta/pm20voc/pr/i/72696
in scheme: pr
narrower: http://zbw.eu/beta/pm20voc/pr/i/72694
notation: RE02.01
scope note: (einschl.: Patente, Patentrecht, Lizenzen, Warenzeichen) @de
NotationLong: RE02.01

NotationLong
sub property of: notation
definition: EXPERIMENTAL: Notation with blanks and leading zeros for sortability.