Bankruptcy law
type: Concept
label: Insolvenzrecht @de
broader: http://zbw.eu/beta/pm20voc/pr/i/72696
in scheme: pr
notation: RE02.02
scope note: (einschl.: Konkursrecht, Vergleichsverfahren, Private Insolvenz) @de
NotationLong: RE02.02

NotationLong
sub property of: notation
definition: EXPERIMENTAL: Notation with blanks and leading zeros for sortability.