Experts
type: Concept
label: Sachverständige @de
broader: http://zbw.eu/beta/pm20voc/pr/i/126618
in scheme: pr
notation: DL07
scope note: (einschl.: GutachterInnen, Technische Überwachung, Warenkontrolle) @de
NotationLong: DL07

NotationLong
sub property of: notation
definition: EXPERIMENTAL: Notation with blanks and leading zeros for sortability.