Public health insurance
type: Concept
label: Gesetzliche Krankenversicherung @de
broader: http://zbw.eu/beta/pm20voc/pr/i/72615
in scheme: pr
narrower: http://zbw.eu/beta/pm20voc/pr/i/72610
notation: SO08.02
scope note: (einschl.: Betriebskrankenkasse; Gesetzliche und private Krankenversicherung, gesetzliche und private Berufsunfähigkeitsversicherung) @de
NotationLong: SO08.02

NotationLong
sub property of: notation
definition: EXPERIMENTAL: Notation with blanks and leading zeros for sortability.