Family policy
type: Concept
label: Familienpolitik @de
broader: http://zbw.eu/beta/pm20voc/pr/i/126719
in scheme: pr
narrower: http://zbw.eu/beta/pm20voc/pr/i/72594
notation: SO02
scope note: (einschl.: Familienfürsorge des Staates,Erziehungsurlaub, Mutterschutz, Kindergeld) @de
NotationLong: SO02

NotationLong
sub property of: notation
definition: EXPERIMENTAL: Notation with blanks and leading zeros for sortability.