Youth policy
type: Concept
label: Jugendpolitik @de
broader: http://zbw.eu/beta/pm20voc/pr/i/126719
in scheme: pr
narrower: http://zbw.eu/beta/pm20voc/pr/i/72562
notation: SO03
scope note: (einschl.: Jugendschutz, Kinderschutz, Kinderpolitik, Jugendhilfe) @de
NotationLong: SO03

NotationLong
sub property of: notation
definition: EXPERIMENTAL: Notation with blanks and leading zeros for sortability.