Eisenbahnverkehrx
type: Concept
broader: http://zbw.eu/beta/pm20voc/pr/i/126650
in scheme: pr
narrower: http://zbw.eu/beta/pm20voc/pr/i/72569
narrower: http://zbw.eu/beta/pm20voc/pr/i/72570
notation: VK05
scope note: (einschl.: Eisenbahngüterverkehr, Eisenbahnpersonenverkehr, Privatbahn, Kleinbahn, Seilbahn, Magnetbahn, Eisenbahntarif)
NotationLong: VK05

NotationLong
sub property of: notation
definition: EXPERIMENTAL: Notation with blanks and leading zeros for sortability. @en