Aviation safety
type: Concept
label: Luftverkehrssicherheit @de
broader: http://zbw.eu/beta/pm20voc/pr/i/72533
in scheme: pr
notation: VK10.01
scope note: (einschl.: Flugsicherung, Luftverkehrsunfall) @de
NotationLong: VK10.01

NotationLong
sub property of: notation
definition: EXPERIMENTAL: Notation with blanks and leading zeros for sortability.