Tourism industry
type: Concept
label: Tourismuswirtschaft @de
broader: http://zbw.eu/beta/pm20voc/pr/i/72522
in scheme: pr
notation: VK11.01
scope note: (einschl.: Tourismusbranche, Reisebüro, Reiseveranstalter) @de
NotationLong: VK11.01

NotationLong
sub property of: notation
definition: EXPERIMENTAL: Notation with blanks and leading zeros for sortability.