International tourism
type: Concept
label: Internationaler Tourismus @de
broader: http://zbw.eu/beta/pm20voc/pr/i/72522
in scheme: pr
notation: VK11.02
scope note: (einschl.: Grenzüberschreitender Reiseverkehr) @de
NotationLong: VK11.02

NotationLong
sub property of: notation
definition: EXPERIMENTAL: Notation with blanks and leading zeros for sortability.