Industrial insurance
type: Concept
label: Industrieversicherung @de
broader: http://zbw.eu/beta/pm20voc/pr/i/126671
in scheme: pr
notation: VS06
scope note: (einschl.: Produzentenhaftung, Industriehaftpflicht, Unternehmensversicherung, Agrarversicherung) @de
NotationLong: VS06

NotationLong
sub property of: notation
definition: EXPERIMENTAL: Notation with blanks and leading zeros for sortability.