Gewerbeimmobilie
type: Concept
broader: http://zbw.eu/beta/pm20voc/pr/i/126683
in scheme: pr
notation: IW02
scope note: (einschl.: Gewerbeimmobilienmarkt, Gewerbeimmobilienverkauf, Gewerbeimmobilienvermietung, Gewerbeimmobilienrecht)
NotationLong: IW02

NotationLong
sub property of: notation
definition: EXPERIMENTAL: Notation with blanks and leading zeros for sortability. @en