Grundbesitz, international
type: Concept
broader: http://zbw.eu/beta/pm20voc/pr/i/126683
in scheme: pr
notation: IW04
scope note: inländischer Grundbesitz und Wohneigentum im Ausland, ausländischer Grundbesitz und Wohneigentum im Inland
NotationLong: IW04

NotationLong
sub property of: notation
definition: EXPERIMENTAL: Notation with blanks and leading zeros for sortability. @en