Preventive care
type: Concept
label: Gesundheitsvorsorge @de
broader: http://zbw.eu/beta/pm20voc/pr/i/72403
in scheme: pr
notation: GE04.05
scope note: (einschl.: Lebensmittelüberwachung, Arzneimittelüberwachung, Infektionskrankheit) @de
NotationLong: GE04.05

NotationLong
sub property of: notation
definition: EXPERIMENTAL: Notation with blanks and leading zeros for sortability.