Competition Policy
type: Concept
label: Wettbewerbspolitik @de
broader: http://zbw.eu/beta/pm20voc/pr/i/124348
editorial note: Fusionen in einzelnen Branchen vgl. aber jeweils bei den Branchen @de
in scheme: pr
notation: VW08
scope note: (einschl.: Wettbewerbsrecht, Wirtschaftskonzentration, Konzentrationspolitik, (Kartelle, Fusionen, Kartellrecht), Unlauterer Wettbewerb) @de
NotationLong: VW08

NotationLong
sub property of: notation
definition: EXPERIMENTAL: Notation with blanks and leading zeros for sortability.