Monetary Policy
type: Concept
label: Geldpolitik @de
broader: http://zbw.eu/beta/pm20voc/pr/i/72352
in scheme: pr
notation: GF03.01
scope note: (einschl.: Geldmenge, Diskontpolitik, Offenmarktpolitik, Mindestreservepolitik, Währungs- und Geldpolitik) @de
NotationLong: GF03.01

NotationLong
sub property of: notation
definition: EXPERIMENTAL: Notation with blanks and leading zeros for sortability.