Bond Market
type: Concept
label: Rentenmarkt @de
broader: http://zbw.eu/beta/pm20voc/pr/i/72349
in scheme: pr
notation: GF04.01.02
scope note: (einschl.: Industrieobligation, Staatsanleihen) @de
NotationLong: GF04.01.02

NotationLong
sub property of: notation
definition: EXPERIMENTAL: Notation with blanks and leading zeros for sortability.