Local finance
type: Concept
label: Gemeindefinanzen @de
broader: http://zbw.eu/beta/pm20voc/pr/i/126533
in scheme: pr
notation: OF10
scope note: (einschl.: kommunale Finanzen, kommunale Gebühr) @de
NotationLong: OF10

NotationLong
sub property of: notation
definition: EXPERIMENTAL: Notation with blanks and leading zeros for sortability.