Agricultural structure
type: Concept
label: Agrarstruktur @de
broader: http://zbw.eu/beta/pm20voc/pr/i/126584
in scheme: pr
narrower: http://zbw.eu/beta/pm20voc/pr/i/72237
notation: LW02
scope note: Kennzeichnet die Struktur der Landwirtschaft und des ländlichen Raumes (einschl.: Bodenreform, Betriebsgröße, Bewirtschaftungsform, Bodennutzung, landwirtschaftliche Inputfaktoren) @de
NotationLong: LW02

NotationLong
sub property of: notation
definition: EXPERIMENTAL: Notation with blanks and leading zeros for sortability.